Target
Alpha-2C adrenergic receptor
Ligand
BDBM31046
Substrate
Ki
33±n/a nM
Comments
PDSP_1479
Citation
 Blaxall, HSMurphy, TJBaker, JCRay, CBylund, DB Characterization of the alpha-2C adrenergic receptor subtype in the opossum kidney and in the OK cell line. J Pharmacol Exp Ther 259:323-9 (1991) Target
Name:
Alpha-2C adrenergic receptor
Synonyms:
ADA2C_DIDVI Alpha-2C adrenergic receptor | adrenergic Alpha2C
Type:
Enzyme Catalytic Domain
Mol. Mass.:
53254.77
Organism:
OPOSSUM
Description:
adrenergic Alpha2C ADRA2C OPOSSUM::P35405
Residue:
469
  
Inhibitor
Name:
BDBM31046
Synonyms:
3-[4,5-dihydro-1H-imidazol-2-ylmethyl-(4-methylphenyl)amino]phenol;methanesulfonic acid 3-[N-(2-imidazolin-2-ylmethyl)-4-methyl-anilino]phenol;mesylic acid MLS000069487 PHENTOLAMINE MESYLATE cid_5775 | cid_91430
Type:
Small organic molecule
Emp. Form.:
C17H19N3O
Mol. Mass.:
281.3523
SMILES:
Cc1ccc(cc1)N(CC1=NCCN1)c1cccc(O)c1
: