Target
Sodium-dependent dopamine transporter
Ligand
BDBM50050098
Substrate
Ki
281±n/a nM
Comments
PDSP_1229
Citation
 Andersen, PH The dopamine inhibitor GBR 12909: selectivity and molecular mechanism of action. Eur J Pharmacol 166:493-504 (1989)  
Target
Name:
Sodium-dependent dopamine transporter
Synonyms:
DA transporter SC6A3_RAT Sodium-dependent dopamine transporter | Sodium-dependent dopamine transporter (DAT)
Type:
Multi-pass membrane protein
Mol. Mass.:
68749.45
Organism:
Rattus norvegicus (rat)
Description:
P23977
Residue:
619
  
Inhibitor
Name:
BDBM50050098
Synonyms:
(S)-Phenyl-(S)-piperidin-2-yl-acetic acid methyl ester; hydrochloride METHYLPHENIDATE
Type:
Small organic molecule
Emp. Form.:
C14H19NO2
Mol. Mass.:
233.3062
SMILES:
COC(=O)[C@H]([C@@H]1CCCCN1)c1ccccc1
: