Target
Dihydrofolate reductase
Ligand
BDBM18050
Substrate
Meas. Tech.
Inhibition Assay
IC50
3.4±0.0 nM
Citation
 Ma, XWoon, RSHo, PCChui, WK Antiproliferative activity against MCF-7 breast cancer cells by diamino-triazaspirodiene antifolates. Chem Biol Drug Des 74:322-6 (2009)  
Target
Name:
Dihydrofolate reductase
Synonyms:
DHFR Dihydrofolate reductase | Dihydrofolate reductase (DHFR)
Type:
Enzyme
Mol. Mass.:
21603.71
Organism:
Bos taurus (Cattle)
Description:
P00376
Residue:
187
  
Inhibitor
Name:
BDBM18050
Synonyms:
2-[(4-{[(2,4-diaminopteridin-6-yl)methyl](methyl)amino}phenyl)formamido]pentanedioic acid MTX cid_126941
Type:
Small organic molecule
Emp. Form.:
C20H22N8O5
Mol. Mass.:
454.4393
SMILES:
CN(Cc1cnc2nc(N)nc(N)c2n1)c1ccc(cc1)C(=O)N[C@@H](CCC(O)=O)C(O)=O
: