Target
Alpha-2A adrenergic receptor
Ligand
BDBM50020192
Substrate
Ki
9.33±n/a nM
Comments
PDSP_1743
Citation
 O'Rourke, MFBlaxall, HSIversen, LJBylund, DB Characterization of [3H]RX821002 binding to alpha-2 adrenergic receptor subtypes. J Pharmacol Exp Ther 268:1362-7 (1994) Target
Name:
Alpha-2A adrenergic receptor
Synonyms:
ADA2A_BOVIN Alpha-2A adrenergic receptor Alpha-2A adrenoreceptor Alpha-2D adrenergic receptor Cerebral cortex alpha adrenergic receptor adrenergic Alpha2D
Type:
Enzyme Catalytic Domain
Mol. Mass.:
49275.13
Organism:
BOVINE
Description:
adrenergic Alpha2 0 BOVINE::Q28838
Residue:
452
  
Inhibitor
Name:
BDBM50020192
Synonyms:
8-(2,3-Dihydro-benzo[1,4]dioxin-2-ylmethyl)-1-phenyl-1,3,8-triaza-spiro[4.5]decan-4-one Spiroxatrine
Type:
Small organic molecule
Emp. Form.:
C22H25N3O3
Mol. Mass.:
379.4522
SMILES:
O=C1NCN(c2ccccc2)C11CCN(CC2COc3ccccc3O2)CC1
: