Target
Hepatocyte growth factor receptor [1038-1346]
Ligand
BDBM106190
Substrate
Meas. Tech.
c-Met In Vitro Kinase Assay
Temperature
303.15±n/a K
IC50
49±n/a nM
Comments
extracted
Citation
 Zhong, BShih, CYuan, HZhou, F Highly selective c-Met inhibitors as anticancer agents US Patent  US9695175 Publication Date 7/4/2017 
Target
Name:
Hepatocyte growth factor receptor [1038-1346]
Synonyms:
Hepatocyte growth factor receptor (MET) MET_HUMAN
Type:
Mol. Mass.:
34804.00
Organism:
Homo sapiens (Human)
Description:
c-Met kinase (1038-1346 aa)
Residue:
309
  
Inhibitor
Name:
BDBM106190
Synonyms:
US9695175, 1
Type:
Small organic molecule
Emp. Form.:
C22H15F4N7O
Mol. Mass.:
469.3944
SMILES:
CNC(=O)c1ccc(cc1F)-c1ccc2nnc(n2n1)C(F)(F)c1ccc2nn(C)cc2c1F
: