Target
Hepatocyte growth factor receptor [1038-1346]
Ligand
BDBM106301
Substrate
Meas. Tech.
c-Met In Vitro Kinase Assay
Temperature
303.15±n/a K
IC50
78±n/a nM
Comments
extracted
Citation
 Zhong, BShih, CYuan, HZhou, F Highly selective c-Met inhibitors as anticancer agents US Patent  US9695175 Publication Date 7/4/2017 
Target
Name:
Hepatocyte growth factor receptor [1038-1346]
Synonyms:
Hepatocyte growth factor receptor (MET) MET_HUMAN
Type:
Mol. Mass.:
34804.00
Organism:
Homo sapiens (Human)
Description:
c-Met kinase (1038-1346 aa)
Residue:
309
  
Inhibitor
Name:
BDBM106301
Synonyms:
US9695175, 17
Type:
Small organic molecule
Emp. Form.:
C20H13F4N7O2S
Mol. Mass.:
491.422
SMILES:
Cn1cc2c(F)c(ccc2n1)C(F)(F)c1nnc2ccc(nn12)-c1ccc(c(F)c1)S(N)(=O)=O
: