Target
Hepatocyte growth factor receptor [1038-1346]
Ligand
BDBM106354
Substrate
Meas. Tech.
c-Met In Vitro Kinase Assay
Temperature
303.15±n/a K
IC50
125±n/a nM
Comments
extracted
Citation
 Zhong, BShih, CYuan, HZhou, F Highly selective c-Met inhibitors as anticancer agents US Patent  US9695175 Publication Date 7/4/2017 
Target
Name:
Hepatocyte growth factor receptor [1038-1346]
Synonyms:
Hepatocyte growth factor receptor (MET) MET_HUMAN
Type:
Mol. Mass.:
34804.00
Organism:
Homo sapiens (Human)
Description:
c-Met kinase (1038-1346 aa)
Residue:
309
  
Inhibitor
Name:
BDBM106354
Synonyms:
US9695175, 25
Type:
Small organic molecule
Emp. Form.:
C25H19F4N7O
Mol. Mass.:
509.4583
SMILES:
Cn1cc2cc(c(F)cc2n1)C(F)(F)c1nnc2ccc(nn12)-c1ccc(C(=O)N2CCCC2)c(F)c1
: