Target
Hepatocyte growth factor receptor [1038-1346]
Ligand
BDBM107090
Substrate
Meas. Tech.
c-Met In Vitro Kinase Assay
Temperature
303.15±n/a K
IC50
127±n/a nM
Comments
extracted
Citation
 Zhong, BShih, CYuan, HZhou, F Highly selective c-Met inhibitors as anticancer agents US Patent  US9695175 Publication Date 7/4/2017 
Target
Name:
Hepatocyte growth factor receptor [1038-1346]
Synonyms:
Hepatocyte growth factor receptor (MET) MET_HUMAN
Type:
Mol. Mass.:
34804.00
Organism:
Homo sapiens (Human)
Description:
c-Met kinase (1038-1346 aa)
Residue:
309
  
Inhibitor
Name:
BDBM107090
Synonyms:
US9695175, 41
Type:
Small organic molecule
Emp. Form.:
C21H17F3N8O2
Mol. Mass.:
470.4073
SMILES:
Cn1cc2cc(c(F)cc2n1)C(F)(F)c1nnc2ccc(nn12)-c1cnn(CC2COCO2)c1
: