Target
Hepatocyte growth factor receptor [1038-1346]
Ligand
BDBM107113
Substrate
Meas. Tech.
c-Met In Vitro Kinase Assay
Temperature
303.15±n/a K
IC50
274±n/a nM
Comments
extracted
Citation
 Zhong, BShih, CYuan, HZhou, F Highly selective c-Met inhibitors as anticancer agents US Patent  US9695175 Publication Date 7/4/2017 
Target
Name:
Hepatocyte growth factor receptor [1038-1346]
Synonyms:
Hepatocyte growth factor receptor (MET) MET_HUMAN
Type:
Mol. Mass.:
34804.00
Organism:
Homo sapiens (Human)
Description:
c-Met kinase (1038-1346 aa)
Residue:
309
  
Inhibitor
Name:
BDBM107113
Synonyms:
US9695175, 45
Type:
Small organic molecule
Emp. Form.:
C21H17ClF3N7
Mol. Mass.:
459.855
SMILES:
Cn1cc2cc(c(F)cc2n1)C(F)(F)C1(Cl)NN=C2C=CC(=CN12)c1cnn(c1)C1CC1
: