Target
5-hydroxytryptamine receptor 1A
Ligand
BDBM82367
Substrate
Ki
0.66±n/a nM
Comments
PDSP_1697
Citation
 Boess, FGMartin, IL Molecular biology of 5-HT receptors. Neuropharmacology 33:275-317 (1994)  
Target
Name:
5-hydroxytryptamine receptor 1A
Synonyms:
5-HT-1A 5-hydroxytryptamine receptor 1A (5-HT-1A) ADRB2RL1 Dopamine D2 receptor and serotonin 1a receptor HTR1A | Serotonin receptor 1A
Type:
Mol. Mass.:
46122.49
Organism:
Homo sapiens (Human)
Description:
Residue:
422
  
Inhibitor
Name:
BDBM82367
Synonyms:
CAS_141533-35-9 SDZ 216-525
Type:
Small organic molecule
Emp. Form.:
C25H28N4O5S
Mol. Mass.:
496.579
SMILES:
COC(=O)c1cc2c(cccc2[nH]1)N1CCN(CCCCN2C(=O)c3ccccc3S2(=O)=O)CC1
: