Target
D(4) dopamine receptor
Ligand
BDBM50041959
Substrate
Ki
132.1±n/a nM
Comments
PDSP_260
Citation
 Lahti, RAEvans, DLStratman, NCFigur, LM Dopamine D4 versus D2 receptor selectivity of dopamine receptor antagonists: possible therapeutic implications. Eur J Pharmacol 236:483-6 (1993)  
Target
Name:
D(4) dopamine receptor
Synonyms:
D(2C) dopamine receptor DOPAMINE D4.2 DRD4 Dopamine D4 receptor
Type:
Enzyme
Mol. Mass.:
48373.19
Organism:
Homo sapiens (Human)
Description:
P21917
Residue:
419
  
Inhibitor
Name:
BDBM50041959
Synonyms:
((1S,2R)-5-Methoxy-1-methyl-1,2,3,4-tetrahydro-naphthalen-2-yl)-propyl-amine (1S,2R)-(5-Methoxy-1-methyl-1,2,3,4-tetrahydro-naphthalen-2-yl)-propyl-amine AJ76(+) | CHEMBL27441
Type:
Small organic molecule
Emp. Form.:
C15H23NO
Mol. Mass.:
233.3492
SMILES:
CCCN[C@@H]1CCc2c(OC)cccc2[C@@H]1C
: