Target
Toll-like receptor 7
Ligand
BDBM273205
Substrate
Meas. Tech.
HEK293-hTLR-7 assay
EC50
156000±n/a nM
Citation
 Wang, BWang, LYun, HZheng, X Substituted aminothiazolopyrimidinedione for the treatment and prophylaxis of virus infection US Patent  US10065973 Publication Date 9/4/2018 
Target
Name:
Toll-like receptor 7
Synonyms:
ORF Names:UNQ248/PRO285 TLR7_HUMAN | Toll-like receptor 7 (TLR7)
Type:
Enzyme
Mol. Mass.:
120945.35
Organism:
Homo sapiens (Human)
Description:
Q9NYK1
Residue:
1049
  
Inhibitor
Name:
BDBM273205
Synonyms:
US10065973, Example 2-A
Type:
Small organic molecule
Emp. Form.:
C14H18N4O5S
Mol. Mass.:
354.382
SMILES:
[H][C@@]1(CO)C[C@@]([H])(C(O)C2CC2)[C@@H](O1)n1c2nc(N)[nH]c(=O)c2sc1=O
: