Target
Toll-like receptor 7
Ligand
BDBM273208
Substrate
Meas. Tech.
HEK293-hTLR-7 assay
EC50
111000±n/a nM
Citation
 Wang, BWang, LYun, HZheng, X Substituted aminothiazolopyrimidinedione for the treatment and prophylaxis of virus infection US Patent  US10065973 Publication Date 9/4/2018 
Target
Name:
Toll-like receptor 7
Synonyms:
ORF Names:UNQ248/PRO285 TLR7_HUMAN | Toll-like receptor 7 (TLR7)
Type:
Enzyme
Mol. Mass.:
120945.35
Organism:
Homo sapiens (Human)
Description:
Q9NYK1
Residue:
1049
  
Inhibitor
Name:
BDBM273208
Synonyms:
US10065973, Example 5-A
Type:
Small organic molecule
Emp. Form.:
C18H20N4O6S
Mol. Mass.:
420.44
SMILES:
[H][C@@]1(CO)C[C@@]([H])(C(O)c2ccccc2OC)[C@@H](O1)n1c2nc(N)[nH]c(=O)c2sc1=O
: