Target
Toll-like receptor 7
Ligand
BDBM273210
Substrate
Meas. Tech.
HEK293-hTLR-7 assay
EC50
225000±n/a nM
Citation
 Wang, BWang, LYun, HZheng, X Substituted aminothiazolopyrimidinedione for the treatment and prophylaxis of virus infection US Patent  US10065973 Publication Date 9/4/2018 
Target
Name:
Toll-like receptor 7
Synonyms:
ORF Names:UNQ248/PRO285 TLR7_HUMAN | Toll-like receptor 7 (TLR7)
Type:
Enzyme
Mol. Mass.:
120945.35
Organism:
Homo sapiens (Human)
Description:
Q9NYK1
Residue:
1049
  
Inhibitor
Name:
BDBM273210
Synonyms:
5-Amino-3-[(2R,3S,5S)-5-(hydroxymethyl)-3-[(S)-hydroxy(2-pyridyl)methyl]tetrahydrofuran-2-yl]-6H-thiazolo[4,5-d]pyrimidine-2,7-dione | US10065973, Example 7
Type:
Small organic molecule
Emp. Form.:
C16H17N5O5S
Mol. Mass.:
391.402
SMILES:
[H][C@@]1(CO)C[C@@]([H])(C(O)c2ccccn2)[C@@H](O1)n1c2nc(N)[nH]c(=O)c2sc1=O
: