Target
Toll-like receptor 7
Ligand
BDBM273217
Substrate
Meas. Tech.
HEK293-hTLR-7 assay
EC50
6500±n/a nM
Citation
 Wang, BWang, LYun, HZheng, X Substituted aminothiazolopyrimidinedione for the treatment and prophylaxis of virus infection US Patent  US10065973 Publication Date 9/4/2018 
Target
Name:
Toll-like receptor 7
Synonyms:
ORF Names:UNQ248/PRO285 TLR7_HUMAN | Toll-like receptor 7 (TLR7)
Type:
Enzyme
Mol. Mass.:
120945.35
Organism:
Homo sapiens (Human)
Description:
Q9NYK1
Residue:
1049
  
Inhibitor
Name:
BDBM273217
Synonyms:
US10065973, Example 12 | [(1R)-1-[(2R,3S,5S)-2-(5-Amino-2,7-dioxo-6H-thiazolo[4,5-d]pyrimidin-3-yl)-5-[(1S)-1-hydroxypropyl]tetrahydrofuran-3-yl]ethyl] benzoate
Type:
Small organic molecule
Emp. Form.:
C21H24N4O6S
Mol. Mass.:
460.503
SMILES:
[H][C@]1(C[C@@]([H])([C@@H](C)OC(=O)c2ccccc2)[C@@H](O1)n1c2nc(N)[nH]c(=O)c2sc1=O)[C@@H](O)CC
: