Target
Toll-like receptor 7
Ligand
BDBM273225
Substrate
Meas. Tech.
HEK293-hTLR-7 assay
EC50
19000±n/a nM
Citation
 Wang, BWang, LYun, HZheng, X Substituted aminothiazolopyrimidinedione for the treatment and prophylaxis of virus infection US Patent  US10065973 Publication Date 9/4/2018 
Target
Name:
Toll-like receptor 7
Synonyms:
ORF Names:UNQ248/PRO285 TLR7_HUMAN | Toll-like receptor 7 (TLR7)
Type:
Enzyme
Mol. Mass.:
120945.35
Organism:
Homo sapiens (Human)
Description:
Q9NYK1
Residue:
1049
  
Inhibitor
Name:
BDBM273225
Synonyms:
US10065973, Example 19 | [1-[(2R,3S,5S)-2-(5-Amino-2,7-dioxo-6H-thiazolo[4,5-d]pyrimidin-3-yl)-5-[(1S)-1-hydroxypropyl]tetrahydrofuran-3-yl]-1-methyl-ethyl] acetate
Type:
Small organic molecule
Emp. Form.:
C17H24N4O6S
Mol. Mass.:
412.461
SMILES:
CC[C@H](O)[C@@H]1C[C@H]([C@@H](O1)n1c2nc(N)[nH]c(=O)c2sc1=O)C(C)(C)OC(C)=O
: