Target
Glucose-6-phosphate dehydrogenase-6-phosphogluconolactonase
Ligand
BDBM34462
Substrate
Meas. Tech.
Dose Response orthogonal kinetic assay utilizing the direct detection of NADPH for uHTS small molecule inhibitors of Plasmodium falciparum Glucose-6-phosphate dehydrogenase
IC50
>80000±n/a nM
Citation
 PubChem, PC Dose Response orthogonal kinetic assay utilizing the direct detection of NADPH for uHTS small molecule inhibitors of Plasmodium falciparum Glucose-6-phosphate dehydrogenase PubChem Bioassay (2011)[AID] 
Target
Name:
Glucose-6-phosphate dehydrogenase-6-phosphogluconolactonase
Synonyms:
Type:
Enzyme Catalytic Domain
Mol. Mass.:
109731.64
Organism:
Plasmodium falciparum 3D7
Description:
gi_12381848
Residue:
950
  
Inhibitor
Name:
BDBM34462
Synonyms:
(3,4-dichlorophenyl)-[4-(2-hydroxyethyl)-1-piperazinyl]methanethione (3,4-dichlorophenyl)-[4-(2-hydroxyethyl)piperazino]methanethione MLS000049575 cid_963027
Type:
Small organic molecule
Emp. Form.:
C13H16Cl2N2OS
Mol. Mass.:
319.25
SMILES:
OCCN1CCN(CC1)C(=S)c1ccc(Cl)c(Cl)c1
: