Target
Carboxy-terminal domain RNA polymerase II polypeptide A small phosphatase 1
Ligand
BDBM82867
Substrate
Meas. Tech.
Dose Response confirmation of uHTS hits for Scp-1 phosphatase using a colorimetric assay
IC50
16549±2154 nM
Citation
 PubChem, PC Dose Response confirmation of uHTS hits for Scp-1 phosphatase using a colorimetric assay PubChem Bioassay (2011)[AID] 
Target
Name:
Carboxy-terminal domain RNA polymerase II polypeptide A small phosphatase 1
Synonyms:
CTDS1_HUMAN NIF3 SCP1 | carboxy-terminal domain RNA polymerase II polypeptide A small phosphatase 1 isoform 1
Type:
Enzyme Catalytic Domain
Mol. Mass.:
29199.89
Organism:
Homo sapiens (Human)
Description:
gi_10864009
Residue:
261
  
Inhibitor
Name:
BDBM82867
Synonyms:
6-penta-1,3-diynyl-2-pyranone MLS000737691 cid_265580
Type:
Small organic molecule
Emp. Form.:
C10H6O2
Mol. Mass.:
158.1534
SMILES:
CC#CC#Cc1cccc(=O)o1
: