Target
Carboxy-terminal domain RNA polymerase II polypeptide A small phosphatase 1
Ligand
BDBM83063
Substrate
Meas. Tech.
Dose Response confirmation of uHTS hits for Scp-1 phosphatase using a colorimetric assay
IC50
4550±107 nM
Citation
 PubChem, PC Dose Response confirmation of uHTS hits for Scp-1 phosphatase using a colorimetric assay PubChem Bioassay (2011)[AID] 
Target
Name:
Carboxy-terminal domain RNA polymerase II polypeptide A small phosphatase 1
Synonyms:
CTDS1_HUMAN NIF3 SCP1 | carboxy-terminal domain RNA polymerase II polypeptide A small phosphatase 1 isoform 1
Type:
Enzyme Catalytic Domain
Mol. Mass.:
29199.89
Organism:
Homo sapiens (Human)
Description:
gi_10864009
Residue:
261
  
Inhibitor
Name:
BDBM83063
Synonyms:
1-(4-fluorophenyl)-4-keto-N-[4-(thiazol-2-ylsulfamoyl)phenyl]pyridazine-3-carboxamide 1-(4-fluorophenyl)-4-oxo-N-[4-(1,3-thiazol-2-ylsulfamoyl)phenyl]pyridazine-3-carboxamide MLS001160470 cid_16455092
Type:
Small organic molecule
Emp. Form.:
C20H14FN5O4S2
Mol. Mass.:
471.485
SMILES:
Fc1ccc(cc1)-n1ccc(=O)c(n1)C(=O)Nc1ccc(cc1)S(=O)(=O)Nc1nccs1
: