Target
Beta-lactamase
Ligand
BDBM83213
Substrate
Meas. Tech.
Counterscreen for inhibitors of TLR9-MyD88 binding: fluorescence-based cell-based high throughput dose response assay to identify non-selective inhibitors of the beta-lactamase enzyme (BLA)
IC50
3924±n/a nM
Citation
 PubChem, PC Counterscreen for inhibitors of TLR9-MyD88 binding: fluorescence-based cell-based high throughput dose response assay to identify non-selective inhibitors of the beta-lactamase enzyme (BLA) PubChem Bioassay (2011)[AID] 
Target
Name:
Beta-lactamase
Synonyms:
Beta lactamase
Type:
Enzyme Catalytic Domain
Mol. Mass.:
31513.38
Organism:
Pseudomonas aeruginosa
Description:
gi_114881106
Residue:
286
  
Inhibitor
Name:
BDBM83213
Synonyms:
3-(4-fluorophenyl)-7,8-dimethoxy-5-(3-methylbenzyl)pyrazolo[4,3-c]quinoline MLS000530102 cid_2136917
Type:
Small organic molecule
Emp. Form.:
C26H22FN3O2
Mol. Mass.:
427.4702
SMILES:
COc1cc2n(Cc3cccc(C)c3)cc3c(nnc3c2cc1OC)-c1ccc(F)cc1
: