Target
Beta-lactamase
Ligand
BDBM67266
Substrate
Meas. Tech.
Counterscreen for inhibitors of TLR9-MyD88 binding: fluorescence-based cell-based high throughput dose response assay to identify non-selective inhibitors of the beta-lactamase enzyme (BLA)
IC50
28626±n/a nM
Citation
 PubChem, PC Counterscreen for inhibitors of TLR9-MyD88 binding: fluorescence-based cell-based high throughput dose response assay to identify non-selective inhibitors of the beta-lactamase enzyme (BLA) PubChem Bioassay (2011)[AID] 
Target
Name:
Beta-lactamase
Synonyms:
Beta lactamase
Type:
Enzyme Catalytic Domain
Mol. Mass.:
31513.38
Organism:
Pseudomonas aeruginosa
Description:
gi_114881106
Residue:
286
  
Inhibitor
Name:
BDBM67266
Synonyms:
4-chloranyl-1-ethyl-3-nitro-quinolin-2-one 4-chloro-1-ethyl-3-nitro-carbostyril MLS000718723 cid_800048
Type:
Small organic molecule
Emp. Form.:
C11H9ClN2O3
Mol. Mass.:
252.654
SMILES:
CCn1c2ccccc2c(Cl)c([N+]([O-])=O)c1=O
: