Target
Beta-lactamase
Ligand
BDBM83275
Substrate
Meas. Tech.
Counterscreen for inhibitors of TLR9-MyD88 binding: fluorescence-based cell-based high throughput dose response assay to identify non-selective inhibitors of the beta-lactamase enzyme (BLA)
IC50
32470±n/a nM
Citation
 PubChem, PC Counterscreen for inhibitors of TLR9-MyD88 binding: fluorescence-based cell-based high throughput dose response assay to identify non-selective inhibitors of the beta-lactamase enzyme (BLA) PubChem Bioassay (2011)[AID] 
Target
Name:
Beta-lactamase
Synonyms:
Beta lactamase
Type:
Enzyme Catalytic Domain
Mol. Mass.:
31513.38
Organism:
Pseudomonas aeruginosa
Description:
gi_114881106
Residue:
286
  
Inhibitor
Name:
BDBM83275
Synonyms:
MLS002701540 cid_457901
Type:
Small organic molecule
Emp. Form.:
C22H30O7
Mol. Mass.:
406.4694
SMILES:
[H]C12CCC3C(C1O)(C(=O)C2=C)C1(O)OCC32CCCC(C)(COC(C)=O)C2C1O
: