Target
Endoribonuclease toxin MazF
Ligand
BDBM83470
Substrate
Meas. Tech.
Dose response confirmation uHTS hits for MazEF TA System activators via a fluorescence-based single-stranded RNase assay counterscreen
EC50
>99000±n/a nM
Citation
 PubChem, PC Dose response confirmation uHTS hits for MazEF TA System activators via a fluorescence-based single-stranded RNase assay counterscreen PubChem Bioassay (2011)[AID] 
Target
Name:
Endoribonuclease toxin MazF
Synonyms:
MAZF_ECOLI chpAK mazF
Type:
Enzyme Catalytic Domain
Mol. Mass.:
12100.43
Organism:
Escherichia coli str. K-12 substr. MG1655
Description:
gi_16130689
Residue:
111
  
Inhibitor
Name:
BDBM83470
Synonyms:
(3-morpholino-1-oxa-3-azonia-2-azanidacyclopent-3-en-5-ylidene)amine;hydrochloride 3-MORPHOLINOSYDNONIMINE MLS000028691 cid_9859122
Type:
Small organic molecule
Emp. Form.:
C6H10N4O2
Mol. Mass.:
170.1692
SMILES:
[NH-]c1c[n+](no1)N1CCOCC1
: