Target
Apoptotic protease-activating factor 1
Ligand
BDBM70611
Substrate
Meas. Tech.
Dose response confirmation of uHTS hits for Apaf-1 in a Fluorescent assay
IC50
4170±n/a nM
Citation
 PubChem, PC Dose response confirmation of uHTS hits for Apaf-1 in a Fluorescent assay PubChem Bioassay (2011)[AID] 
Target
Name:
Apoptotic protease-activating factor 1
Synonyms:
APAF1 Apoptotic peptidase activating factor 1 | KIAA0413
Type:
Enzyme Catalytic Domain
Mol. Mass.:
141834.40
Organism:
Homo sapiens (Human)
Description:
O14727
Residue:
1248
  
Inhibitor
Name:
BDBM70611
Synonyms:
4-[1-(4-bromophenyl)-2-nitro-ethyl]-5-methyl-2-phenyl-1H-pyrazol-3-one 4-[1-(4-bromophenyl)-2-nitroethyl]-5-methyl-2-phenyl-1H-pyrazol-3-one MLS000540808 cid_3575535
Type:
Small organic molecule
Emp. Form.:
C18H16BrN3O3
Mol. Mass.:
402.242
SMILES:
Cc1[nH]n(-c2ccccc2)c(=O)c1C(C[N+]([O-])=O)c1ccc(Br)cc1
: