Target
Apoptotic protease-activating factor 1
Ligand
BDBM42216
Substrate
Meas. Tech.
Dose response confirmation of uHTS hits for Apaf-1 in a Fluorescent assay
IC50
3760±n/a nM
Citation
 PubChem, PC Dose response confirmation of uHTS hits for Apaf-1 in a Fluorescent assay PubChem Bioassay (2011)[AID] 
Target
Name:
Apoptotic protease-activating factor 1
Synonyms:
APAF1 Apoptotic peptidase activating factor 1 | KIAA0413
Type:
Enzyme Catalytic Domain
Mol. Mass.:
141834.40
Organism:
Homo sapiens (Human)
Description:
O14727
Residue:
1248
  
Inhibitor
Name:
BDBM42216
Synonyms:
3-(4-fluoroanilino)-2H-isoquinolin-1-one 3-[(4-fluorophenyl)amino]-2H-isoquinolin-1-one SMR000152650 | cid_2323972
Type:
Small organic molecule
Emp. Form.:
C15H11FN2O
Mol. Mass.:
254.259
SMILES:
Fc1ccc(Nc2cc3ccccc3c(=O)[nH]2)cc1
: