Target
Apoptotic protease-activating factor 1
Ligand
BDBM83899
Substrate
Meas. Tech.
Dose Response validation of Inhibitors of Apaf-1 using a Fluorescent Interference Counterscreen assay
IC50
>100000±0 nM
Citation
 PubChem, PC Dose Response validation of Inhibitors of Apaf-1 using a Fluorescent Interference Counterscreen assay PubChem Bioassay (2011)[AID] 
Target
Name:
Apoptotic protease-activating factor 1
Synonyms:
APAF1 Apoptotic peptidase activating factor 1 | KIAA0413
Type:
Enzyme Catalytic Domain
Mol. Mass.:
141834.40
Organism:
Homo sapiens (Human)
Description:
O14727
Residue:
1248
  
Inhibitor
Name:
BDBM83899
Synonyms:
1-Hydroxy-3-methyl-2-(3-methyl-butyl)-benzo[4,5]imidazo[1,2-a]pyridine-4-carbonitrile 3-methyl-2-(3-methylbutyl)-1-oxidanylidene-5H-pyrido[1,2-a]benzimidazole-4-carbonitrile MLS000551357 cid_703093
Type:
Small organic molecule
Emp. Form.:
C18H19N3O
Mol. Mass.:
293.363
SMILES:
CC(C)CCc1c(C)c(C#N)c2[nH]c3ccccc3n2c1=O
: