Target
Apoptotic protease-activating factor 1
Ligand
BDBM53457
Substrate
Meas. Tech.
Dose Response validation of Inhibitors of Apaf-1 using a Fluorescent Interference Counterscreen assay
IC50
>100000±0 nM
Citation
 PubChem, PC Dose Response validation of Inhibitors of Apaf-1 using a Fluorescent Interference Counterscreen assay PubChem Bioassay (2011)[AID] 
Target
Name:
Apoptotic protease-activating factor 1
Synonyms:
APAF1 Apoptotic peptidase activating factor 1 | KIAA0413
Type:
Enzyme Catalytic Domain
Mol. Mass.:
141834.40
Organism:
Homo sapiens (Human)
Description:
O14727
Residue:
1248
  
Inhibitor
Name:
BDBM53457
Synonyms:
2,4-bis(bromanyl)-6-[(quinolin-8-ylamino)methyl]phenol 2,4-dibromo-6-[(8-quinolylamino)methyl]phenol MLS001183429 SMR000503121 | cid_1994749
Type:
Small organic molecule
Emp. Form.:
C16H12Br2N2O
Mol. Mass.:
408.087
SMILES:
Oc1c(Br)cc(Br)cc1CNc1cccc2cccnc12
: