Target
Apoptotic protease-activating factor 1
Ligand
BDBM53185
Substrate
Meas. Tech.
Dose Response validation of Inhibitors of Apaf-1 using a Fluorescent Interference Counterscreen assay
IC50
20400±5870 nM
Citation
 PubChem, PC Dose Response validation of Inhibitors of Apaf-1 using a Fluorescent Interference Counterscreen assay PubChem Bioassay (2011)[AID] 
Target
Name:
Apoptotic protease-activating factor 1
Synonyms:
APAF1 Apoptotic peptidase activating factor 1 | KIAA0413
Type:
Enzyme Catalytic Domain
Mol. Mass.:
141834.40
Organism:
Homo sapiens (Human)
Description:
O14727
Residue:
1248
  
Inhibitor
Name:
BDBM53185
Synonyms:
2-(trifluoromethyl)-1H-perimidine-4-carbaldehyde MLS001171482 cid_5665177
Type:
Small organic molecule
Emp. Form.:
C13H7F3N2O
Mol. Mass.:
264.2027
SMILES:
FC(F)(F)c1nc2cccc3ccc(C=O)c([nH]1)c23
: