Target
Caspase-9
Ligand
BDBM83899
Substrate
Meas. Tech.
Dose response confirmation of uHTS hits for Apaf-1 using a LZ-Caspase-9/Caspase-3 Fluorescent Selectivity assay
IC50
53500±n/a nM
Citation
 PubChem, PC Dose response confirmation of uHTS hits for Apaf-1 using a LZ-Caspase-9/Caspase-3 Fluorescent Selectivity assay PubChem Bioassay (2011)[AID] 
Target
Name:
Caspase-9
Synonyms:
Apoptotic protease-activating factor 1/Caspase-3/Caspase-9/Cytochrome c CASP-9 CASP9_HUMAN ICE-like apoptotic protease 6 caspase-9 isoform alpha preproprotein
Type:
Enzyme
Mol. Mass.:
46277.29
Organism:
Homo sapiens (Human)
Description:
Residue:
416
  
Inhibitor
Name:
BDBM83899
Synonyms:
1-Hydroxy-3-methyl-2-(3-methyl-butyl)-benzo[4,5]imidazo[1,2-a]pyridine-4-carbonitrile 3-methyl-2-(3-methylbutyl)-1-oxidanylidene-5H-pyrido[1,2-a]benzimidazole-4-carbonitrile MLS000551357 cid_703093
Type:
Small organic molecule
Emp. Form.:
C18H19N3O
Mol. Mass.:
293.363
SMILES:
CC(C)CCc1c(C)c(C#N)c2[nH]c3ccccc3n2c1=O
: