Target
Caspase-9
Ligand
BDBM70611
Substrate
Meas. Tech.
Dose response confirmation of uHTS hits for Apaf-1 using a LZ-Caspase-9/Caspase-3 Fluorescent Selectivity assay
IC50
6790±n/a nM
Citation
 PubChem, PC Dose response confirmation of uHTS hits for Apaf-1 using a LZ-Caspase-9/Caspase-3 Fluorescent Selectivity assay PubChem Bioassay (2011)[AID] 
Target
Name:
Caspase-9
Synonyms:
Apoptotic protease-activating factor 1/Caspase-3/Caspase-9/Cytochrome c CASP-9 CASP9_HUMAN ICE-like apoptotic protease 6 caspase-9 isoform alpha preproprotein
Type:
Enzyme
Mol. Mass.:
46277.29
Organism:
Homo sapiens (Human)
Description:
Residue:
416
  
Inhibitor
Name:
BDBM70611
Synonyms:
4-[1-(4-bromophenyl)-2-nitro-ethyl]-5-methyl-2-phenyl-1H-pyrazol-3-one 4-[1-(4-bromophenyl)-2-nitroethyl]-5-methyl-2-phenyl-1H-pyrazol-3-one MLS000540808 cid_3575535
Type:
Small organic molecule
Emp. Form.:
C18H16BrN3O3
Mol. Mass.:
402.242
SMILES:
Cc1[nH]n(-c2ccccc2)c(=O)c1C(C[N+]([O-])=O)c1ccc(Br)cc1
: