Target
Caspase-9
Ligand
BDBM53457
Substrate
Meas. Tech.
Dose response confirmation of uHTS hits for Apaf-1 using a LZ-Caspase-9/Caspase-3 Fluorescent Selectivity assay
IC50
14000±n/a nM
Citation
 PubChem, PC Dose response confirmation of uHTS hits for Apaf-1 using a LZ-Caspase-9/Caspase-3 Fluorescent Selectivity assay PubChem Bioassay (2011)[AID] 
Target
Name:
Caspase-9
Synonyms:
Apoptotic protease-activating factor 1/Caspase-3/Caspase-9/Cytochrome c CASP-9 CASP9_HUMAN ICE-like apoptotic protease 6 caspase-9 isoform alpha preproprotein
Type:
Enzyme
Mol. Mass.:
46277.29
Organism:
Homo sapiens (Human)
Description:
Residue:
416
  
Inhibitor
Name:
BDBM53457
Synonyms:
2,4-bis(bromanyl)-6-[(quinolin-8-ylamino)methyl]phenol 2,4-dibromo-6-[(8-quinolylamino)methyl]phenol MLS001183429 SMR000503121 | cid_1994749
Type:
Small organic molecule
Emp. Form.:
C16H12Br2N2O
Mol. Mass.:
408.087
SMILES:
Oc1c(Br)cc(Br)cc1CNc1cccc2cccnc12
: