Target
Caspase-9
Ligand
BDBM53185
Substrate
Meas. Tech.
Dose response confirmation of uHTS hits for Apaf-1 using a LZ-Caspase-9/Caspase-3 Fluorescent Selectivity assay
IC50
11800±n/a nM
Citation
 PubChem, PC Dose response confirmation of uHTS hits for Apaf-1 using a LZ-Caspase-9/Caspase-3 Fluorescent Selectivity assay PubChem Bioassay (2011)[AID] 
Target
Name:
Caspase-9
Synonyms:
Apoptotic protease-activating factor 1/Caspase-3/Caspase-9/Cytochrome c CASP-9 CASP9_HUMAN ICE-like apoptotic protease 6 caspase-9 isoform alpha preproprotein
Type:
Enzyme
Mol. Mass.:
46277.29
Organism:
Homo sapiens (Human)
Description:
Residue:
416
  
Inhibitor
Name:
BDBM53185
Synonyms:
2-(trifluoromethyl)-1H-perimidine-4-carbaldehyde MLS001171482 cid_5665177
Type:
Small organic molecule
Emp. Form.:
C13H7F3N2O
Mol. Mass.:
264.2027
SMILES:
FC(F)(F)c1nc2cccc3ccc(C=O)c([nH]1)c23
: