Target
Apoptotic protease-activating factor 1
Ligand
BDBM61728
Substrate
Meas. Tech.
Dose Response validation of Activators of Apaf-1 using a Fluorescent Interference Counterscreen assay
EC50
>100000±0 nM
Citation
 PubChem, PC Dose Response validation of Activators of Apaf-1 using a Fluorescent Interference Counterscreen assay PubChem Bioassay (2011)[AID] 
Target
Name:
Apoptotic protease-activating factor 1
Synonyms:
APAF1 Apoptotic peptidase activating factor 1 | KIAA0413
Type:
Enzyme Catalytic Domain
Mol. Mass.:
141834.40
Organism:
Homo sapiens (Human)
Description:
O14727
Residue:
1248
  
Inhibitor
Name:
BDBM61728
Synonyms:
MLS000830182 N-(4-oxidanylidenethieno[3,2-d][1,3]thiazin-2-yl)furan-2-carboxamide N-(4-oxo-4H-thieno[3,2-d][1,3]thiazin-2-yl)-2-furamide SMR000458103 | cid_2810061
Type:
Small organic molecule
Emp. Form.:
C11H6N2O3S2
Mol. Mass.:
278.307
SMILES:
O=C(Nc1nc2ccsc2c(=O)s1)c1ccco1
: