Target
Multidrug resistance protein CDR1
Ligand
BDBM57893
Substrate
Meas. Tech.
Dose Response HTS singleplex for inhibitors of yeast efflux pump, specifically Cdr1 with Hit compounds from Cherry Pick1
EC50
27100±n/a nM
Citation
 PubChem, PC Dose Response HTS singleplex for inhibitors of yeast efflux pump, specifically Cdr1 with Hit compounds from Cherry Pick1 PubChem Bioassay (2011)[AID] 
Target
Name:
Multidrug resistance protein CDR1
Synonyms:
CDR1 Multidrug resistance protein CDR1 | drug resistance protein 1
Type:
PROTEIN
Mol. Mass.:
169942.67
Organism:
Candida albicans
Description:
ChEMBL_708756
Residue:
1501
  
Inhibitor
Name:
BDBM57893
Synonyms:
(2Z,5Z)-2,5-bis(4-hydroxy-3-methoxybenzylidene)cyclopentanone (2Z,5Z)-2,5-bis[(4-hydroxy-3-methoxyphenyl)methylidene]-1-cyclopentanone (2Z,5Z)-2,5-divanillylidenecyclopentanone SMR000312315 | cid_6477637
Type:
Small organic molecule
Emp. Form.:
C21H20O5
Mol. Mass.:
352.3805
SMILES:
COc1cc(\C=C2\CC\C(=C\c3ccc(O)c(OC)c3)C2=O)ccc1O
: