Target
Beta-2 adrenergic receptor
Ligand
BDBM55514
Substrate
Meas. Tech.
Dose response for HTS for Beta-2AR agonists via FAP method from CP1
EC50
402±n/a nM
Citation
 PubChem, PC Dose response for HTS for Beta-2AR agonists via FAP method from CP1 PubChem Bioassay (2011)[AID] 
Target
Name:
Beta-2 adrenergic receptor
Synonyms:
ADRB2 ADRB2_HUMAN Beta-2 adrenoceptor | Beta-2 adrenoreceptor
Type:
Mol. Mass.:
46461.69
Organism:
Homo sapiens (Human)
Description:
P07550
Residue:
413
  
Inhibitor
Name:
BDBM55514
Synonyms:
(2-oxidanylidene-1,2-diphenyl-ethyl) 3-acetamido-4-methyl-benzoate 2-oxo-1,2-diphenylethyl 3-(acetylamino)-4-methylbenzoate 3-acetamido-4-methylbenzoic acid (2-oxo-1,2-diphenylethyl) ester SMR000197964 | cid_2934084
Type:
Small organic molecule
Emp. Form.:
C24H21NO4
Mol. Mass.:
387.4278
SMILES:
CC(=O)Nc1cc(ccc1C)C(=O)OC(C(=O)c1ccccc1)c1ccccc1
: