Target
Toll-like receptor 9
Ligand
BDBM273388
Substrate
Meas. Tech.
TLR7/8/9 Inhibition Reporter Assay
Temperature
298.15±n/a K
IC50
11528±n/a nM
Comments
extracted
Citation
 Dyckman, AJDodd, DSMacor, JEMussari, CPPasunoori, LKumar, SRSherwood, TCSistla, RK [1,2,4]triazolo[1,5-a]pyridinyl substituted indole compounds US Patent  US10071079 Publication Date 9/11/2018 
Target
Name:
Toll-like receptor 9
Synonyms:
CD_antigen: CD289 TLR9_HUMAN
Type:
Enzyme
Mol. Mass.:
115889.91
Organism:
Homo sapiens (Human)
Description:
Q9NR96
Residue:
1032
  
Inhibitor
Name:
BDBM273388
Synonyms:
US10071079, Example 171 | US10478424, Example 172
Type:
Small organic molecule
Emp. Form.:
C28H32N6
Mol. Mass.:
452.5939
SMILES:
CC(C)c1c([nH]c2ccc(cc12)C1CCN(CC2(CC2)C#N)CC1)-c1cc(C)c2ncnn2c1
: