Target
D(4) dopamine receptor
Ligand
BDBM84451
Substrate
Meas. Tech.
Binding Assay
Ki
0.6±0.0 nM
Citation
 Hendrix, JAShimshock, SJShutske, GMTomer, JDKapples, KJPalermo, MGCorbett, TJVargas, HMKafka, SBrooks, KMLaws-Ricker, LLee, DKde Lannoy, IBordeleau, MRizkalla, GOwolabi, JKamboj, RK Synthesis and structure-activity relationship of the isoindolinyl benzisoxazolpiperidines as potent, selective, and orally active human dopamine D4 receptor antagonists. Chembiochem 3:999-1009 (2002)  
Target
Name:
D(4) dopamine receptor
Synonyms:
D(2C) dopamine receptor DOPAMINE D4.2 DRD4 Dopamine D4 receptor
Type:
Enzyme
Mol. Mass.:
48373.19
Organism:
Homo sapiens (Human)
Description:
P21917
Residue:
419
  
Inhibitor
Name:
BDBM84451
Synonyms:
Isoindoline, 18 | Isoindoline, 19
Type:
Small organic molecule
Emp. Form.:
C24H28FN3O3
Mol. Mass.:
425.4958
SMILES:
COc1ccc2CN(CC(CO)N3CCC(CC3)c3noc4cc(F)ccc34)Cc2c1
: