Target
D(4) dopamine receptor
Ligand
BDBM84454
Substrate
Meas. Tech.
Binding Assay
Ki
583±0.0 nM
Citation
 Hendrix, JAShimshock, SJShutske, GMTomer, JDKapples, KJPalermo, MGCorbett, TJVargas, HMKafka, SBrooks, KMLaws-Ricker, LLee, DKde Lannoy, IBordeleau, MRizkalla, GOwolabi, JKamboj, RK Synthesis and structure-activity relationship of the isoindolinyl benzisoxazolpiperidines as potent, selective, and orally active human dopamine D4 receptor antagonists. Chembiochem 3:999-1009 (2002)  
Target
Name:
D(4) dopamine receptor
Synonyms:
D(2C) dopamine receptor DOPAMINE D4.2 DRD4 Dopamine D4 receptor
Type:
Enzyme
Mol. Mass.:
48373.19
Organism:
Homo sapiens (Human)
Description:
P21917
Residue:
419
  
Inhibitor
Name:
BDBM84454
Synonyms:
Isoindoline, 21
Type:
Small organic molecule
Emp. Form.:
C23H22FN3O4
Mol. Mass.:
423.4369
SMILES:
OCC(CN1C(=O)c2ccccc2C1=O)N1CCC(CC1)c1noc2cc(F)ccc12
: