Target
D(2) dopamine receptor
Ligand
BDBM84449
Substrate
Meas. Tech.
Binding Assay
Ki
185±0.0 nM
Citation
 Hendrix, JAShimshock, SJShutske, GMTomer, JDKapples, KJPalermo, MGCorbett, TJVargas, HMKafka, SBrooks, KMLaws-Ricker, LLee, DKde Lannoy, IBordeleau, MRizkalla, GOwolabi, JKamboj, RK Synthesis and structure-activity relationship of the isoindolinyl benzisoxazolpiperidines as potent, selective, and orally active human dopamine D4 receptor antagonists. Chembiochem 3:999-1009 (2002)  
Target
Name:
D(2) dopamine receptor
Synonyms:
D(2) dopamine receptor DOPAMINE D2 Long DRD2 Dopamine D2 receptor Dopamine D2 receptor (D2R) Dopamine2-like | d2
Type:
Cell-surface receptors
Mol. Mass.:
50647.10
Organism:
Homo sapiens (Human)
Description:
P14416
Residue:
443
  
Inhibitor
Name:
BDBM84449
Synonyms:
Isoindoline, 16
Type:
Small organic molecule
Emp. Form.:
C24H28FN3O2
Mol. Mass.:
409.4964
SMILES:
Cc1cccc2CN(CC(CO)N3CCC(CC3)c3noc4cc(F)ccc34)Cc12
: