Target
Cyclin-dependent kinase 1
Ligand
BDBM84532
Substrate
Meas. Tech.
Kinase Assay
pH
7.5±0
Temperature
303.15±0 K
IC50
100±0.0 nM
Citation
 Kunick, CZeng, ZGussio, RZaharevitz, DLeost, MTotzke, FSchächtele, CKubbutat, MHMeijer, LLemcke, T Structure-aided optimization of kinase inhibitors derived from alsterpaullone. Chembiochem 6:541-9 (2005)  
Target
Name:
Cyclin-dependent kinase 1
Synonyms:
CDC2 CDK1 CDKN1 Cell division protein kinase 1 P34CDC2 | p34 protein kinase
Type:
Enzyme Subunit
Mol. Mass.:
34101.08
Organism:
Homo sapiens (Human)
Description:
P06493
Residue:
297
  
Inhibitor
Name:
BDBM84532
Synonyms:
Alsterpaullone derivative, 6
Type:
Small organic molecule
Emp. Form.:
C20H17N3O5
Mol. Mass.:
379.3661
SMILES:
COC(=O)CCc1ccc2NC(=O)Cc3c([nH]c4ccc(cc34)[N+]([O-])=O)-c2c1
: