Target
CREB-binding protein
Ligand
BDBM274323
Substrate
Meas. Tech.
Assay for CREB protein
pH
7.5±n/a
Temperature
303.15±n/a K
IC50
1500±n/a nM
Comments
extracted
Citation
 Rueger, HBlank, JBordas, VCotesta, SBold, GGuagnano, VVaupel, A Pyrrolopyrrolone derivatives and their use as BET inhibitors US Patent  US9550796 Publication Date 1/24/2017 
Target
Name:
CREB-binding protein
Synonyms:
CBP CREB-binding protein (CBP) CREBBP
Type:
Transcription Coactivator
Mol. Mass.:
265411.66
Organism:
Homo sapiens (Human)
Description:
Q92793
Residue:
2442
  
Inhibitor
Name:
BDBM274323
Synonyms:
Ethyl 6-(4-chlorophenyl)-5-(3,8-dimethyl-[1,2,4]triazolo[4,3-a]pyridin-6-yl)-2-(2-methoxypyridin-3-yl)-3-methyl-4-oxo-5,6-dihydropyrrolo[3,4-b]pyrrole-1(4H)-carboxylate | US9550796, Example 124
Type:
Small organic molecule
Emp. Form.:
C30H27ClN6O4
Mol. Mass.:
571.026
SMILES:
CCOC(=O)n1c2C(N(C(=O)c2c(C)c1-c1cccnc1OC)c1cc(C)c2nnc(C)n2c1)c1ccc(Cl)cc1
: