Target
Sigma non-opioid intracellular receptor 1
Ligand
BDBM50000072
Substrate
Meas. Tech.
ChEBML_226551
Ki
7.4±n/a nM
Citation
 de Costa, BRRadesca, LDi Paolo, LBowen, WD Synthesis, characterization, and biological evaluation of a novel class of N-(arylethyl)-N-alkyl-2-(1-pyrrolidinyl)ethylamines: structural requirements and binding affinity at the sigma receptor. J Med Chem 35:38-47 (1992)  
Target
Name:
Sigma non-opioid intracellular receptor 1
Synonyms:
Aging-associated gene 8 protein SGMR1_HUMAN SIGMAR1 SR31747-binding protein Sigma 1-type opioid receptor Sigma1R | hSigmaR1
Type:
Enzyme Catalytic Domain
Mol. Mass.:
25124.85
Organism:
Homo sapiens (Human)
Description:
Q99720
Residue:
223
  
Inhibitor
Name:
BDBM50000072
Synonyms:
CHEMBL409984 | Methyl-phenethyl-(2-pyrrolidin-1-yl-ethyl)-amine
Type:
Small organic molecule
Emp. Form.:
C15H24N2
Mol. Mass.:
232.3645
SMILES:
CN(CCN1CCCC1)CCc1ccccc1
: