Target
G-protein coupled receptor 84
Ligand
BDBM50239194
Substrate
Meas. Tech.
ChEMBL_1665424 (CHEMBL4015220)
EC50
4330±n/a nM
Citation
 Pillaiyar, TKöse, MSylvester, KWeighardt, HThimm, DBorges, GFörster, Ivon Kügelgen, IMüller, CE Diindolylmethane Derivatives: Potent Agonists of the Immunostimulatory Orphan G Protein-Coupled Receptor GPR84. J Med Chem 60:3636-3655 (2017)  
Target
Name:
G-protein coupled receptor 84
Synonyms:
EX33 GPR84 Inflammation-related G-protein coupled receptor EX33
Type:
PROTEIN
Mol. Mass.:
43726.73
Organism:
Homo sapiens (Human)
Description:
ChEMBL_116040
Residue:
396
  
Inhibitor
Name:
BDBM50239194
Synonyms:
CHEMBL4101728
Type:
Small organic molecule
Emp. Form.:
C17H12F2N2
Mol. Mass.:
282.2874
SMILES:
Fc1ccc2[nH]cc(Cc3c[nH]c4ccc(F)cc34)c2c1
: