Target
DNA (cytosine-5)-methyltransferase 1
Ligand
BDBM50239287
Substrate
Meas. Tech.
ChEMBL_1665873 (CHEMBL4015669)
EC50
73000±n/a nM
Citation
 Halby, LMenon, YRilova, EPechalrieu, DMasson, VFaux, CBouhlel, MADavid-Cordonnier, MHNovosad, NAussagues, YSamson, ALacroix, LAusseil, FFleury, LGuianvarc'h, DFerroud, CArimondo, PB Rational Design of Bisubstrate-Type Analogues as Inhibitors of DNA Methyltransferases in Cancer Cells. J Med Chem 60:4665-4679 (2017)  
Target
Name:
DNA (cytosine-5)-methyltransferase 1
Synonyms:
AIM CXXC9 DNA (cytosine-5)-methyltransferase 1 isoform b DNA methyltransferase HsaI DNMT1 M.HsaI | MCMT
Type:
Enzyme
Mol. Mass.:
183184.85
Organism:
Homo sapiens (Human)
Description:
P26358
Residue:
1616
  
Inhibitor
Name:
BDBM50239287
Synonyms:
CHEMBL4100095
Type:
Small organic molecule
Emp. Form.:
C33H37N7O
Mol. Mass.:
547.6932
SMILES:
C(CNc1ncnc2cc(OCC3CCN(CCNc4ccnc5ccccc45)CC3)ccc12)Nc1ccccc1
: