Target
DNA (cytosine-5)-methyltransferase 1
Ligand
BDBM50239292
Substrate
Meas. Tech.
ChEMBL_1665873 (CHEMBL4015669)
EC50
16000±n/a nM
Citation
 Halby, LMenon, YRilova, EPechalrieu, DMasson, VFaux, CBouhlel, MADavid-Cordonnier, MHNovosad, NAussagues, YSamson, ALacroix, LAusseil, FFleury, LGuianvarc'h, DFerroud, CArimondo, PB Rational Design of Bisubstrate-Type Analogues as Inhibitors of DNA Methyltransferases in Cancer Cells. J Med Chem 60:4665-4679 (2017)  
Target
Name:
DNA (cytosine-5)-methyltransferase 1
Synonyms:
AIM CXXC9 DNA (cytosine-5)-methyltransferase 1 isoform b DNA methyltransferase HsaI DNMT1 M.HsaI | MCMT
Type:
Enzyme
Mol. Mass.:
183184.85
Organism:
Homo sapiens (Human)
Description:
P26358
Residue:
1616
  
Inhibitor
Name:
BDBM50239292
Synonyms:
CHEMBL4070549
Type:
Small organic molecule
Emp. Form.:
C38H40N6O
Mol. Mass.:
596.7638
SMILES:
C(CNc1ncnc2cc(OCC3CCN(CCNc4ccnc5ccccc45)CC3)ccc12)Cc1cccc2ccccc12
: