Target
DNA (cytosine-5)-methyltransferase 1
Ligand
BDBM50239293
Substrate
Meas. Tech.
ChEMBL_1665873 (CHEMBL4015669)
EC50
30000±n/a nM
Citation
 Halby, LMenon, YRilova, EPechalrieu, DMasson, VFaux, CBouhlel, MADavid-Cordonnier, MHNovosad, NAussagues, YSamson, ALacroix, LAusseil, FFleury, LGuianvarc'h, DFerroud, CArimondo, PB Rational Design of Bisubstrate-Type Analogues as Inhibitors of DNA Methyltransferases in Cancer Cells. J Med Chem 60:4665-4679 (2017)  
Target
Name:
DNA (cytosine-5)-methyltransferase 1
Synonyms:
AIM CXXC9 DNA (cytosine-5)-methyltransferase 1 isoform b DNA methyltransferase HsaI DNMT1 M.HsaI | MCMT
Type:
Enzyme
Mol. Mass.:
183184.85
Organism:
Homo sapiens (Human)
Description:
P26358
Residue:
1616
  
Inhibitor
Name:
BDBM50239293
Synonyms:
CHEMBL4076088
Type:
Small organic molecule
Emp. Form.:
C36H42N6O3
Mol. Mass.:
606.7571
SMILES:
COc1cc2nccc(NCCN3CCC(COc4ccc5c(NCCCc6ccccc6)ncnc5c4)CC3)c2cc1OC
: