Target
E3 ubiquitin-protein ligase XIAP
Ligand
BDBM50239422
Substrate
Meas. Tech.
ChEMBL_1666042 (CHEMBL4015838)
IC50
0.017000±n/a nM
Citation
 Tamanini, EBuck, IMChessari, GChiarparin, EDay, JEHFrederickson, MGriffiths-Jones, CMHearn, KHeightman, TDIqbal, AJohnson, CNLewis, EJMartins, VPeakman, TReader, MRich, SJWard, GAWilliams, PAWilsher, NE Discovery of a Potent Nonpeptidomimetic, Small-Molecule Antagonist of Cellular Inhibitor of Apoptosis Protein 1 (cIAP1) and X-Linked Inhibitor of Apoptosis Protein (XIAP). J Med Chem 60:4611-4625 (2017)  
Target
Name:
E3 ubiquitin-protein ligase XIAP
Synonyms:
API3 E3 ubiquitin-protein ligase XIAP Inhibitor of apoptosis protein 3 X-linked inhibitor of apoptosis XIAP | XIAP_HUMAN
Type:
Protein
Mol. Mass.:
56685.27
Organism:
Homo sapiens (Human)
Description:
P98170
Residue:
497
  
Inhibitor
Name:
BDBM50239422
Synonyms:
CHEMBL234346
Type:
Small organic molecule
Emp. Form.:
C19H34N4O5
Mol. Mass.:
398.4971
SMILES:
CC[C@H](C)[C@H](NC(=O)[C@@H]1CCCN1C(=O)[C@@H](NC(=O)[C@H](C)N)C(C)C)C(O)=O
: