Target
Polyunsaturated fatty acid 5-lipoxygenase
Ligand
BDBM50000537
Substrate
Meas. Tech.
ChEMBL_4196 (CHEMBL619998)
IC50
45±n/a nM
Citation
 Lau, CKBélanger, PCDufresne, CScheigetz, JTherien, MFitzsimmons, BYoung, RNFord-Hutchinson, AWRiendeau, DDenis, D Development of 2,3-dihydro-6-(3-phenoxypropyl)-2-(2-phenylethyl)-5-benzofuranol (L-670,630) as a potent and orally active inhibitor of 5-lipoxygenase. J Med Chem 35:1299-318 (1992)  
Target
Name:
Polyunsaturated fatty acid 5-lipoxygenase
Synonyms:
Alox5 LOX5_RAT
Type:
PROTEIN
Mol. Mass.:
78082.31
Organism:
Rattus norvegicus
Description:
ChEMBL_1432947
Residue:
673
  
Inhibitor
Name:
BDBM50000537
Synonyms:
2-Phenethyl-4-propyl-6-{3-[4-(5H-tetrazol-5-yl)-phenoxy]-propyl}-2,3-dihydro-benzofuran-5-ol | CHEMBL278861
Type:
Small organic molecule
Emp. Form.:
C29H32N4O3
Mol. Mass.:
484.5894
SMILES:
CCCc1c2CC(CCc3ccccc3)Oc2cc(CCCOc2ccc(cc2)-c2nnn[nH]2)c1O
: