Target
Polyunsaturated fatty acid 5-lipoxygenase
Ligand
BDBM50000545
Substrate
Meas. Tech.
ChEMBL_4196 (CHEMBL619998)
IC50
50±n/a nM
Citation
 Lau, CKBélanger, PCDufresne, CScheigetz, JTherien, MFitzsimmons, BYoung, RNFord-Hutchinson, AWRiendeau, DDenis, D Development of 2,3-dihydro-6-(3-phenoxypropyl)-2-(2-phenylethyl)-5-benzofuranol (L-670,630) as a potent and orally active inhibitor of 5-lipoxygenase. J Med Chem 35:1299-318 (1992)  
Target
Name:
Polyunsaturated fatty acid 5-lipoxygenase
Synonyms:
Alox5 LOX5_RAT
Type:
PROTEIN
Mol. Mass.:
78082.31
Organism:
Rattus norvegicus
Description:
ChEMBL_1432947
Residue:
673
  
Inhibitor
Name:
BDBM50000545
Synonyms:
8-[3-(5-Hydroxy-2-phenethyl-2,3-dihydro-benzofuran-6-yl)-propylsulfanyl]-2-methoxy-quinoline-3-carboxylic acid | CHEMBL282904
Type:
Small organic molecule
Emp. Form.:
C30H29NO5S
Mol. Mass.:
515.62
SMILES:
COc1nc2c(SCCCc3cc4OC(CCc5ccccc5)Cc4cc3O)cccc2cc1C(O)=O
: