Target
Polyunsaturated fatty acid 5-lipoxygenase
Ligand
BDBM50000552
Substrate
Meas. Tech.
ChEMBL_4196 (CHEMBL619998)
IC50
51±n/a nM
Citation
 Lau, CKBélanger, PCDufresne, CScheigetz, JTherien, MFitzsimmons, BYoung, RNFord-Hutchinson, AWRiendeau, DDenis, D Development of 2,3-dihydro-6-(3-phenoxypropyl)-2-(2-phenylethyl)-5-benzofuranol (L-670,630) as a potent and orally active inhibitor of 5-lipoxygenase. J Med Chem 35:1299-318 (1992)  
Target
Name:
Polyunsaturated fatty acid 5-lipoxygenase
Synonyms:
Alox5 LOX5_RAT
Type:
PROTEIN
Mol. Mass.:
78082.31
Organism:
Rattus norvegicus
Description:
ChEMBL_1432947
Residue:
673
  
Inhibitor
Name:
BDBM50000552
Synonyms:
2-[2-(4-Chloro-phenyl)-ethyl]-6-(3-phenoxy-propyl)-2,3-dihydro-benzofuran-5-ol | CHEMBL278817
Type:
Small organic molecule
Emp. Form.:
C25H25ClO3
Mol. Mass.:
408.917
SMILES:
Oc1cc2CC(CCc3ccc(Cl)cc3)Oc2cc1CCCOc1ccccc1
: